Registrarse
Home
Foros
Miembros
Calendario
Normas
Ayuda

Foros de usuarios de openSUSE
Retroceder   ForoSUSE > Zona Técnica > Internet, Redes y Wireless


Síguenos en Twitter Suscríbete a nuestras noticias Acompáñanos en Facebook

Respuesta
 
Herramientas Desplegado

[SOLUCIONADO] Problemas para compilar driver Ralink RT2870
  #1  
Antiguo 10-ene-2011, 14:49
lbianchi lbianchi está desconectado
Aforado
 
Fecha de Ingreso: 11-noviembre-2010
Ubicación: Esquel, Chubut - Argentina
Versión: 11.4
Mensajes: 16
Agradecimientos: 3
Agradecido 0 Veces en 0 Mensajes
Poder de Credibilidad: 0
lbianchi está en el buen camino
[SOLUCIONADO] Problemas para compilar driver Ralink RT2870

Hola,
estoy tratando de instalar una antena wifi Kozumi 1501N (http://www.kozumi-usa.com/new/produc...s/k1501un.html) en OpenSuse 11.3.
Trae el driver 2009_0525_RT3070_Linux_STA_v2.1.1.0.
Estuve siguiendo las instrucciones para compilarlo que vienen en el README del driver y que son las mismas que figuran aquí, http://jarvik.wordpress.com/2009/04/...2870-en-linux/, por ejemplo.
Pero me aparecen algunos errores al intentar compilarlo que no logro entender qué significan.
Primero me logeo como root,
al ejecutar make, obtengo
Código:
make -C tools
make[1]: se ingresa al directorio `/home/lbianchi/Escritorio/2009_0525_RT3070_Linux_STA_v2.1.1.0/tools'
gcc -g bin2h.c -o bin2h
make[1]: se sale del directorio `/home/lbianchi/Escritorio/2009_0525_RT3070_Linux_STA_v2.1.1.0/tools'
/home/lbianchi/Escritorio/2009_0525_RT3070_Linux_STA_v2.1.1.0/tools/bin2h
cp -f os/linux/Makefile.6 /home/lbianchi/Escritorio/2009_0525_RT3070_Linux_STA_v2.1.1.0/os/linux/Makefile
make  -C  /lib/modules/2.6.34-12-desktop/build SUBDIRS=/home/lbianchi/Escritorio/2009_0525_RT3070_Linux_STA_v2.1.1.0/os/linux modules
make: *** /lib/modules/2.6.34-12-desktop/build: No existe el fichero o el directorio.  Alto.
make: *** [LINUX] Error 2
Luego al hacer make install me sale lo siguiente:
Código:
make -C /home/lbianchi/Escritorio/2009_0525_RT3070_Linux_STA_v2.1.1.0/os/linux -f Makefile.6 install
mkdir: no se puede crear el directorio «/etc/Wireless»: El fichero ya existe
make[1]: se ingresa al directorio `/home/lbianchi/Escritorio/2009_0525_RT3070_Linux_STA_v2.1.1.0/os/linux'
rm -rf /etc/Wireless/RT3070STA
mkdir /etc/Wireless/RT3070STA
cp /home/lbianchi/Escritorio/2009_0525_RT3070_Linux_STA_v2.1.1.0/RT2870STA.dat /etc/Wireless/RT3070STA/.
install -d /lib/modules/2.6.34-12-desktop/kernel/drivers/net/wireless/
install -m 644 -c rt3070sta.ko /lib/modules/2.6.34-12-desktop/kernel/drivers/net/wireless/
install: no se puede efectuar `stat' sobre «rt3070sta.ko»: No existe el fichero o el directorio
make[1]: *** [install] Error 1
make[1]: se sale del directorio `/home/lbianchi/Escritorio/2009_0525_RT3070_Linux_STA_v2.1.1.0/os/linux'
make: *** [install] Error 2
linux-gci9:/home/lbianchi/Escritorio/2009_0525_RT3070_Linux_STA_v2.1.1.0 # insmod rt2870.ko
insmod: can't read 'rt2870.ko': No such file or directory
linux-gci9:/home/lbianchi/Escritorio/2009_0525_RT3070_Linux_STA_v2.1.1.0 # insmod rt2870sta.ko
insmod: can't read 'rt2870sta.ko': No such file or directory
linux-gci9:/home/lbianchi/Escritorio/2009_0525_RT3070_Linux_STA_v2.1.1.0 # cd os
linux-gci9:/home/lbianchi/Escritorio/2009_0525_RT3070_Linux_STA_v2.1.1.0/os # cd linux
Aparentemente no existen ni 'rt2870sta.ko' ni 'rt3070sta.ko'.

¿Cuál puede ser el problema? ¿me falta instalar algo par compilar correctamente? En esa computadora no tengo internet, pero utilizando el DVD como repositorio instalé de yast los paquetes 'make' y todos los que encontré que empezaban con 'gcc'.

También me instalé (el paquete) ndiswrapper, aunque no intenté utilizarlo porque prefería hacer andar los drivers linux.
Pasé varias horas buscando soluciones en internet pero aunque encotré varias guias para compilar el driver no encontré nadie que tuviera el mismo problema.
Espero me puedan dar una mano, gracias.

Lucas.

Última edición por lbianchi; 11-ene-2011 a las 12:46 Razón: Encontré la solución al problema que dio origen a la pregunta.
Responder Citando
  #2  
Antiguo 10-ene-2011, 14:54
Avatar de davmont
davmont davmont está desconectado
Moderador
 
Fecha de Ingreso: 13-diciembre-2007
Ubicación: ~/
Versión: 12.3 x86_64
Mensajes: 2.871
Agradecimientos: 78
Agradecido 138 Veces en 122 Mensajes
Poder de Credibilidad: 9
davmont está en el buen camino
instala el patrón de desarrollo del kernel, desde yast o con zypper (a elegir), igual tienes algún problema por eso...

por lo pronto, el primer bloque de texto te está diciendo que no tienes las fuentes del kernel instaladas... lo que no entiendo es por qué hiciste make install, si te dio error de compilación...

un saludo
__________________
No atiendo consultas sobre Linux/openSUSE por privado, usad el foro que para algo está
Normas del foro, de lectura obligada


Responder Citando
  #3  
Antiguo 10-ene-2011, 19:53
lbianchi lbianchi está desconectado
Aforado
 
Fecha de Ingreso: 11-noviembre-2010
Ubicación: Esquel, Chubut - Argentina
Versión: 11.4
Mensajes: 16
Agradecimientos: 3
Agradecido 0 Veces en 0 Mensajes
Poder de Credibilidad: 0
lbianchi está en el buen camino
Gracias por la respuesta,
la verdad es que hice 'make install' porque no tengo mucha idea y no sabía realmente si había compilado con un error menor y podía seguir adelante. Lo hice para probar.

Bueno, instalé los patrones de desarrollo del kernel y ahora al compilar lo que me aparece es lo siguiente:
Código:
lbianchi@linux-gci9:~/Escritorio/2009_0525_RT3070_Linux_STA_v2.1.1.0> sudo make
root's password:
make -C tools
make[1]: se ingresa al directorio `/home/lbianchi/Escritorio/2009_0525_RT3070_Linux_STA_v2.1.1.0/tools'
gcc -g bin2h.c -o bin2h
make[1]: se sale del directorio `/home/lbianchi/Escritorio/2009_0525_RT3070_Linux_STA_v2.1.1.0/tools'
/home/lbianchi/Escritorio/2009_0525_RT3070_Linux_STA_v2.1.1.0/tools/bin2h
cp -f os/linux/Makefile.6 /home/lbianchi/Escritorio/2009_0525_RT3070_Linux_STA_v2.1.1.0/os/linux/Makefile
make  -C  /lib/modules/2.6.34-12-desktop/build SUBDIRS=/home/lbianchi/Escritorio/2009_0525_RT3070_Linux_STA_v2.1.1.0/os/linux modules
make[1]: se ingresa al directorio `/usr/src/linux-2.6.34-12-obj/i386/desktop'
make -C ../../../linux-2.6.34-12 O=/usr/src/linux-2.6.34-12-obj/i386/desktop/. modules
  CC [M]  /home/lbianchi/Escritorio/2009_0525_RT3070_Linux_STA_v2.1.1.0/os/linux/../../common/crypt_md5.o
  CC [M]  /home/lbianchi/Escritorio/2009_0525_RT3070_Linux_STA_v2.1.1.0/os/linux/../../common/crypt_sha2.o
  CC [M]  /home/lbianchi/Escritorio/2009_0525_RT3070_Linux_STA_v2.1.1.0/os/linux/../../common/crypt_hmac.o
  CC [M]  /home/lbianchi/Escritorio/2009_0525_RT3070_Linux_STA_v2.1.1.0/os/linux/../../common/mlme.o
/home/lbianchi/Escritorio/2009_0525_RT3070_Linux_STA_v2.1.1.0/os/linux/../../common/mlme.c: In function ‘BssTableSetEntry’:
/home/lbianchi/Escritorio/2009_0525_RT3070_Linux_STA_v2.1.1.0/os/linux/../../common/mlme.c:4002:39: warning: operation on ‘Tab->BssOverlapNr’ may be undefined
  CC [M]  /home/lbianchi/Escritorio/2009_0525_RT3070_Linux_STA_v2.1.1.0/os/linux/../../common/cmm_wep.o
  CC [M]  /home/lbianchi/Escritorio/2009_0525_RT3070_Linux_STA_v2.1.1.0/os/linux/../../common/action.o
  CC [M]  /home/lbianchi/Escritorio/2009_0525_RT3070_Linux_STA_v2.1.1.0/os/linux/../../common/cmm_data.o
  CC [M]  /home/lbianchi/Escritorio/2009_0525_RT3070_Linux_STA_v2.1.1.0/os/linux/../../common/rtmp_init.o
/home/lbianchi/Escritorio/2009_0525_RT3070_Linux_STA_v2.1.1.0/os/linux/../../common/rtmp_init.c: In function ‘RtmpRaDevCtrlInit’:
/home/lbianchi/Escritorio/2009_0525_RT3070_Linux_STA_v2.1.1.0/os/linux/../../common/rtmp_init.c:3710:2: warning: passing argument 2 of ‘os_alloc_mem’ from incompatible pointer type
/home/lbianchi/Escritorio/2009_0525_RT3070_Linux_STA_v2.1.1.0/include/rtmp.h:5687:13: note: expected ‘UCHAR **’ but argument is of type ‘UCHAR *’
  CC [M]  /home/lbianchi/Escritorio/2009_0525_RT3070_Linux_STA_v2.1.1.0/os/linux/../../common/cmm_tkip.o
  CC [M]  /home/lbianchi/Escritorio/2009_0525_RT3070_Linux_STA_v2.1.1.0/os/linux/../../common/cmm_aes.o
  CC [M]  /home/lbianchi/Escritorio/2009_0525_RT3070_Linux_STA_v2.1.1.0/os/linux/../../common/cmm_sync.o
  CC [M]  /home/lbianchi/Escritorio/2009_0525_RT3070_Linux_STA_v2.1.1.0/os/linux/../../common/eeprom.o
  CC [M]  /home/lbianchi/Escritorio/2009_0525_RT3070_Linux_STA_v2.1.1.0/os/linux/../../common/cmm_sanity.o
  CC [M]  /home/lbianchi/Escritorio/2009_0525_RT3070_Linux_STA_v2.1.1.0/os/linux/../../common/cmm_info.o
  CC [M]  /home/lbianchi/Escritorio/2009_0525_RT3070_Linux_STA_v2.1.1.0/os/linux/../../common/cmm_cfg.o
  CC [M]  /home/lbianchi/Escritorio/2009_0525_RT3070_Linux_STA_v2.1.1.0/os/linux/../../common/cmm_wpa.o
  CC [M]  /home/lbianchi/Escritorio/2009_0525_RT3070_Linux_STA_v2.1.1.0/os/linux/../../common/dfs.o
  CC [M]  /home/lbianchi/Escritorio/2009_0525_RT3070_Linux_STA_v2.1.1.0/os/linux/../../common/spectrum.o
  CC [M]  /home/lbianchi/Escritorio/2009_0525_RT3070_Linux_STA_v2.1.1.0/os/linux/../../common/rtmp_timer.o
  CC [M]  /home/lbianchi/Escritorio/2009_0525_RT3070_Linux_STA_v2.1.1.0/os/linux/../../common/rt_channel.o
  CC [M]  /home/lbianchi/Escritorio/2009_0525_RT3070_Linux_STA_v2.1.1.0/os/linux/../../common/cmm_profile.o
  CC [M]  /home/lbianchi/Escritorio/2009_0525_RT3070_Linux_STA_v2.1.1.0/os/linux/../../common/cmm_asic.o
  CC [M]  /home/lbianchi/Escritorio/2009_0525_RT3070_Linux_STA_v2.1.1.0/os/linux/../../sta/assoc.o
/home/lbianchi/Escritorio/2009_0525_RT3070_Linux_STA_v2.1.1.0/os/linux/../../sta/assoc.c: In function ‘wext_notify_event_assoc’:
/home/lbianchi/Escritorio/2009_0525_RT3070_Linux_STA_v2.1.1.0/os/linux/../../sta/assoc.c:1401:3: warning: pointer targets in passing argument 5 of ‘RtmpOSWrielessEventSend’ differ in signedness
/home/lbianchi/Escritorio/2009_0525_RT3070_Linux_STA_v2.1.1.0/include/rtmp.h:7025:5: note: expected ‘PUCHAR’ but argument is of type ‘char *’
  CC [M]  /home/lbianchi/Escritorio/2009_0525_RT3070_Linux_STA_v2.1.1.0/os/linux/../../sta/auth.o
  CC [M]  /home/lbianchi/Escritorio/2009_0525_RT3070_Linux_STA_v2.1.1.0/os/linux/../../sta/auth_rsp.o
  CC [M]  /home/lbianchi/Escritorio/2009_0525_RT3070_Linux_STA_v2.1.1.0/os/linux/../../sta/sync.o
  CC [M]  /home/lbianchi/Escritorio/2009_0525_RT3070_Linux_STA_v2.1.1.0/os/linux/../../sta/sanity.o
  CC [M]  /home/lbianchi/Escritorio/2009_0525_RT3070_Linux_STA_v2.1.1.0/os/linux/../../sta/rtmp_data.o
  CC [M]  /home/lbianchi/Escritorio/2009_0525_RT3070_Linux_STA_v2.1.1.0/os/linux/../../sta/connect.o
/home/lbianchi/Escritorio/2009_0525_RT3070_Linux_STA_v2.1.1.0/os/linux/../../sta/connect.c: In function ‘LinkDown’:
/home/lbianchi/Escritorio/2009_0525_RT3070_Linux_STA_v2.1.1.0/os/linux/../../sta/connect.c:1975:11: warning: unused variable ‘Cancelled’
  CC [M]  /home/lbianchi/Escritorio/2009_0525_RT3070_Linux_STA_v2.1.1.0/os/linux/../../sta/wpa.o
  CC [M]  /home/lbianchi/Escritorio/2009_0525_RT3070_Linux_STA_v2.1.1.0/os/linux/../../os/linux/rt_linux.o
/home/lbianchi/Escritorio/2009_0525_RT3070_Linux_STA_v2.1.1.0/os/linux/../../os/linux/rt_linux.c: In function ‘RtmpOSNetDevAttach’:
/home/lbianchi/Escritorio/2009_0525_RT3070_Linux_STA_v2.1.1.0/os/linux/../../os/linux/rt_linux.c:1510:10: error: ‘struct net_device’ has no member named ‘open’
/home/lbianchi/Escritorio/2009_0525_RT3070_Linux_STA_v2.1.1.0/os/linux/../../os/linux/rt_linux.c:1511:10: error: ‘struct net_device’ has no member named ‘stop’
/home/lbianchi/Escritorio/2009_0525_RT3070_Linux_STA_v2.1.1.0/os/linux/../../os/linux/rt_linux.c:1512:10: error: ‘struct net_device’ has no member named ‘hard_start_xmit’
/home/lbianchi/Escritorio/2009_0525_RT3070_Linux_STA_v2.1.1.0/os/linux/../../os/linux/rt_linux.c:1513:10: error: ‘struct net_device’ has no member named ‘do_ioctl’
/home/lbianchi/Escritorio/2009_0525_RT3070_Linux_STA_v2.1.1.0/os/linux/../../os/linux/rt_linux.c:1519:11: error: ‘struct net_device’ has no member named ‘get_stats’
/home/lbianchi/Escritorio/2009_0525_RT3070_Linux_STA_v2.1.1.0/os/linux/../../os/linux/rt_linux.c:1553:9: error: ‘struct net_device’ has no member named ‘validate_addr’
make[4]: *** [/home/lbianchi/Escritorio/2009_0525_RT3070_Linux_STA_v2.1.1.0/os/linux/../../os/linux/rt_linux.o] Error 1
make[3]: *** [_module_/home/lbianchi/Escritorio/2009_0525_RT3070_Linux_STA_v2.1.1.0/os/linux] Error 2
make[2]: *** [sub-make] Error 2
make[1]: *** [all] Error 2
make[1]: se sale del directorio `/usr/src/linux-2.6.34-12-obj/i386/desktop'
make: *** [LINUX] Error 2
lbianchi@linux-gci9:~/Escritorio/2009_0525_RT3070_Linux_STA_v2.1.1.0> sudo make install
make -C /home/lbianchi/Escritorio/2009_0525_RT3070_Linux_STA_v2.1.1.0/os/linux -f Makefile.6 install
mkdir: no se puede crear el directorio «/etc/Wireless»: El fichero ya existe
make[1]: se ingresa al directorio `/home/lbianchi/Escritorio/2009_0525_RT3070_Linux_STA_v2.1.1.0/os/linux'
rm -rf /etc/Wireless/RT3070STA
mkdir /etc/Wireless/RT3070STA
cp /home/lbianchi/Escritorio/2009_0525_RT3070_Linux_STA_v2.1.1.0/RT2870STA.dat /etc/Wireless/RT3070STA/.
install -d /lib/modules/2.6.34-12-desktop/kernel/drivers/net/wireless/
install -m 644 -c rt3070sta.ko /lib/modules/2.6.34-12-desktop/kernel/drivers/net/wireless/
install: no se puede efectuar `stat' sobre «rt3070sta.ko»: No existe el fichero o el directorio
make[1]: *** [install] Error 1
make[1]: se sale del directorio `/home/lbianchi/Escritorio/2009_0525_RT3070_Linux_STA_v2.1.1.0/os/linux'
make: *** [install] Error 2
lbianchi@linux-gci9:~/Escritorio/2009_0525_RT3070_Linux_STA_v2.1.1.0> sudo make
make -C tools
make[1]: se ingresa al directorio `/home/lbianchi/Escritorio/2009_0525_RT3070_Linux_STA_v2.1.1.0/tools'
gcc -g bin2h.c -o bin2h
make[1]: se sale del directorio `/home/lbianchi/Escritorio/2009_0525_RT3070_Linux_STA_v2.1.1.0/tools'
/home/lbianchi/Escritorio/2009_0525_RT3070_Linux_STA_v2.1.1.0/tools/bin2h
cp -f os/linux/Makefile.6 /home/lbianchi/Escritorio/2009_0525_RT3070_Linux_STA_v2.1.1.0/os/linux/Makefile
make  -C  /lib/modules/2.6.34-12-desktop/build SUBDIRS=/home/lbianchi/Escritorio/2009_0525_RT3070_Linux_STA_v2.1.1.0/os/linux modules
make[1]: se ingresa al directorio `/usr/src/linux-2.6.34-12-obj/i386/desktop'
make -C ../../../linux-2.6.34-12 O=/usr/src/linux-2.6.34-12-obj/i386/desktop/. modules
  CC [M]  /home/lbianchi/Escritorio/2009_0525_RT3070_Linux_STA_v2.1.1.0/os/linux/../../os/linux/rt_linux.o
/home/lbianchi/Escritorio/2009_0525_RT3070_Linux_STA_v2.1.1.0/os/linux/../../os/linux/rt_linux.c: In function ‘RtmpOSNetDevAttach’:
/home/lbianchi/Escritorio/2009_0525_RT3070_Linux_STA_v2.1.1.0/os/linux/../../os/linux/rt_linux.c:1510:10: error: ‘struct net_device’ has no member named ‘open’
/home/lbianchi/Escritorio/2009_0525_RT3070_Linux_STA_v2.1.1.0/os/linux/../../os/linux/rt_linux.c:1511:10: error: ‘struct net_device’ has no member named ‘stop’
/home/lbianchi/Escritorio/2009_0525_RT3070_Linux_STA_v2.1.1.0/os/linux/../../os/linux/rt_linux.c:1512:10: error: ‘struct net_device’ has no member named ‘hard_start_xmit’
/home/lbianchi/Escritorio/2009_0525_RT3070_Linux_STA_v2.1.1.0/os/linux/../../os/linux/rt_linux.c:1513:10: error: ‘struct net_device’ has no member named ‘do_ioctl’
/home/lbianchi/Escritorio/2009_0525_RT3070_Linux_STA_v2.1.1.0/os/linux/../../os/linux/rt_linux.c:1519:11: error: ‘struct net_device’ has no member named ‘get_stats’
/home/lbianchi/Escritorio/2009_0525_RT3070_Linux_STA_v2.1.1.0/os/linux/../../os/linux/rt_linux.c:1553:9: error: ‘struct net_device’ has no member named ‘validate_addr’
make[4]: *** [/home/lbianchi/Escritorio/2009_0525_RT3070_Linux_STA_v2.1.1.0/os/linux/../../os/linux/rt_linux.o] Error 1
make[3]: *** [_module_/home/lbianchi/Escritorio/2009_0525_RT3070_Linux_STA_v2.1.1.0/os/linux] Error 2
make[2]: *** [sub-make] Error 2
make[1]: *** [all] Error 2
make[1]: se sale del directorio `/usr/src/linux-2.6.34-12-obj/i386/desktop'
make: *** [LINUX] Error 2
lbianchi@linux-gci9:~/Escritorio/2009_0525_RT3070_Linux_STA_v2.1.1.0> sudo make install
make -C /home/lbianchi/Escritorio/2009_0525_RT3070_Linux_STA_v2.1.1.0/os/linux -f Makefile.6 install                                                                               
mkdir: no se puede crear el directorio «/etc/Wireless»: El fichero ya existe                                                                                                       
make[1]: se ingresa al directorio `/home/lbianchi/Escritorio/2009_0525_RT3070_Linux_STA_v2.1.1.0/os/linux'                                                                         
rm -rf /etc/Wireless/RT3070STA                                                                                                                                                     
mkdir /etc/Wireless/RT3070STA                                                                                                                                                      
cp /home/lbianchi/Escritorio/2009_0525_RT3070_Linux_STA_v2.1.1.0/RT2870STA.dat /etc/Wireless/RT3070STA/.                                                                           
install -d /lib/modules/2.6.34-12-desktop/kernel/drivers/net/wireless/                                                                                                             
install -m 644 -c rt3070sta.ko /lib/modules/2.6.34-12-desktop/kernel/drivers/net/wireless/                                                                                         
install: no se puede efectuar `stat' sobre «rt3070sta.ko»: No existe el fichero o el directorio                                                                                    
make[1]: *** [install] Error 1                                                                                                                                                     
make[1]: se sale del directorio `/home/lbianchi/Escritorio/2009_0525_RT3070_Linux_STA_v2.1.1.0/os/linux'                                                                           
make: *** [install] Error 2
algo avancé, pero sigo sin poder compilar.
¿qué puedo hacer?
Gracias.
Lucas.
Responder Citando
  #4  
Antiguo 11-ene-2011, 09:22
Avatar de DiabloRojo
DiabloRojo DiabloRojo está desconectado
Super Moderador
 
Fecha de Ingreso: 19-marzo-2005
Ubicación: En un lugar del planeta Tierra
Versión: La ultima estable
Mensajes: 13.935
Agradecimientos: 333
Agradecido 1.162 Veces en 747 Mensajes
Poder de Credibilidad: 10
DiabloRojo está en el buen camino
Tienes que instalar el -devel de tu kernel como se llame:

Mas fácil, abre una consola, copia y pega los comandos a ejecutar:
Tu kernel es:
uname -r
Instala el -devel de ese kernel:
sudo zypper install kernel-`uname -r | cut -f 3 -d '-'`-devel
__________________
NORMAS A CUMPLIR EN LOS FOROS (Lectura obligatoria) Lo siento, no contesto privados sobre problemas con GNU/Linux.
Síguenos en TWITTER y en FACEBOOK
Código:
Buscador de   Alojamiento      Alojamiento     Otros
 paquetes:    de imágenes:     de ficheros:    buscadores:
Search        TinyPic          Ifile Wuala     Simple y Facil
Webpinstant   SubirImagenes    SendSpace       TextSnip  Cl1p
Responder Citando
  #5  
Antiguo 11-ene-2011, 12:45
lbianchi lbianchi está desconectado
Aforado
 
Fecha de Ingreso: 11-noviembre-2010
Ubicación: Esquel, Chubut - Argentina
Versión: 11.4
Mensajes: 16
Agradecimientos: 3
Agradecido 0 Veces en 0 Mensajes
Poder de Credibilidad: 0
lbianchi está en el buen camino
Gracias a todos por la ayuda, no llegué a probar lo que me propone DiabloRojo, ¿lo podría haber hecho sin conexión a internet? el único repositorio que tengo es el del DVD.

Finalmente logré compilar y puse a funcionar la antena USB con el NetworkManager, ya veré más adelante si sigo así o lo cambio.
La solución la encontré en esta página:
http://ubuntuforums.org/showthread.php?t=1285828&page=3

Bueno, gracias y hasta pronto con más dudas, cada vez me gusta más OpenSuse.

Lucas.

PD: la verdad es que no entendí porque ejecutando el patch que bajé de esa página si pude compilar, si alguien pudiera explicarlo sería ideal para poder aprender algo más.

Última edición por lbianchi; 11-ene-2011 a las 12:48
Responder Citando
  #6  
Antiguo 11-ene-2011, 13:56
jcsl jcsl está desconectado
Miembro FOROSuSE
 
Fecha de Ingreso: 18-mayo-2008
Versión: 13.1
Mensajes: 2.000
Agradecimientos: 0
Agradecido 787 Veces en 512 Mensajes
Poder de Credibilidad: 9
jcsl llegará a ser famoso muy pronto
Hola.

Al ejecutar el comando patch uno de los parámetros es un fichero con modificaciones que se aplicarán en otros ficheros que están indicados en el que sirve de parámetro. Además de los ficheros que se van a modificar, el archivo que se le pasa a patch como parámetro también tiene las modificaciones que se van a llevar a cabo en cada uno de ellos. El resultado es como si editaras tú mismo los ficheros e hicieras las modificaciones a mano. Lo que haces al aplicar un parche es corregir errores en los ficheros que se modifiquen, y, por tanto, esa es la razón de que pudieras compilar el módulo, sustituiste código que estaba mal por otro correcto.

Un saludo.
Responder Citando
Respuesta

Marcadores


(0 miembros y 1 visitantes)
 
Herramientas
Desplegado

Normas de Publicación
No puedes crear nuevos temas
No puedes responder mensajes
No puedes subir archivos adjuntos
No puedes editar tus mensajes

Los Códigos BB están Activado
Las Caritas están Activado
[IMG] está Activado
El Código HTML está Desactivado

Ir al Foro

Temas Similares
Tema Autor Foro Respuestas Último mensaje
Instalar version 8.33.6-x86.x86_64 del driver ATI DiabloRojo FAQs, Manuales y Tutoriales 121 19-ago-2009 09:47
Ares en Linux sin emular willicl Software 18 11-ago-2009 21:11
Desktop de Open Suse 10.3 solo usa 2/3 de mi pantalla galessandro Hardware 4 13-mar-2008 15:03
Problemas con la actualización de OpenSuse 10.3 gery Instalación y Actualizaciones 18 28-oct-2007 17:43
Como instalar lo driver para tu tarjeta NVIDIA maldito71 FAQs, Manuales y Tutoriales 25 23-sep-2007 19:16



Síguenos en Twitter Suscríbete a nuestras noticias Acompáñanos en Facebook


La franja horaria es GMT +2. Ahora son las 09:11.
Powered by vBulletin™
Copyright © vBulletin Solutions, Inc. All rights reserved.

Esta página está bajo una licencia de Creative Commons, salvo que no se indique lo contrario.
Creative Commons License

Valid CSS!

Diseño por:Designed by: vbdesigns.devbdesigns.de 
Contáctenos - ForoSUSE - Archivo - Declaración de Privacidad - Arriba